{"text_format":"1","workbook":"xlsx","n_sheets":4,"sheets":["Master Sheet","Calculator","Calc Sheet","User's Guide"],"not_rendered":{"charts":0,"images":10,"macros":1,"external_links":0,"defined_names":4,"comments":0,"pivot_tables":0},"unopened":[],"bounds":{"document_bytes":16777216,"sheet_cells":100000,"rows_first":2000,"rows_last":500,"rows_between":2000,"halvings":0,"cell_chars":16384,"cell_head_chars":4096},"cells_cut":0,"cells_raw":0,"read":"whole","date_system":"1900"}

{"sheet":"Master Sheet","index":0,"n_rows":138,"n_cols":4,"rows_kept":138,"cut":false,"hidden":true,"merged":[]}
["Chemical","CAS No.","Final Toxicity Values","Basis for Final Toxicity Values"]
["Acenaphthene","83-32-9","Not Available","No RfC/IUR Available for This Contaminant"]
["Acetone (2-Propanone)","67-64-1","Not Available","No RfC/IUR Available for This Contaminant"]
["Acetophenone","98-86-2","Not Available","No RfC/IUR Available for This Contaminant"]
["Aldrin","309-00-2","Not Available","No RfC/IUR Available for This Contaminant"]
["Aluminum (total)","7429-90-5",5,"Inhalation Reference Concentration (µg/m3)"]
["Anthracene","120-12-7","Not Available","No RfC/IUR Available for This Contaminant"]
["Antimony (total)","7440-36-0",2.9999999999999997E-4,"Inhalation Reference Concentration (µg/m3)"]
["Arsenic (total)","7440-38-2",4.3E-3,"Inhalation Unit Risk Factor (µg/m3)-1"]
["Atrazine","1912-24-9","Not Available","No RfC/IUR Available for This Contaminant"]
["Barium (total)","7440-39-3",0.5,"Inhalation Reference Concentration (µg/m3)"]
["Benzaldehyde","100-52-7","Not Available","No RfC/IUR Available for This Contaminant"]
["Benzene","71-43-2",30,"Inhalation Reference Concentration (µg/m3)"]
["Benzo(a)anthracene (1,2-Benzanthracene)","56-55-3",6.0000000000000002E-5,"Inhalation Unit Risk Factor (µg/m3)-1"]
["Benzo(a)pyrene","50-32-8",2E-3,"Inhalation Reference Concentration (µg/m3)"]
["Benzo(b)fluoranthene (3,4-Benzofluoranthene)","205-99-2",6.0000000000000002E-5,"Inhalation Unit Risk Factor (µg/m3)-1"]
["Benzo(k)fluoranthene","207-08-9",6.0000000000000002E-6,"Inhalation Unit Risk Factor (µg/m3)-1"]
["Beryllium","7440-41-7",0.02,"Inhalation Reference Concentration (µg/m3)"]
["1,1'-Biphenyl","92-52-4","Not Available","No RfC/IUR Available for This Contaminant"]
["Bis(2-chloroethoxy)methane","111-91-1","Not Available","No RfC/IUR Available for This Contaminant"]
{"$rows_left_out":119}
{"sheet":"Calculator","index":1,"n_rows":17,"n_cols":16,"rows_kept":17,"cut":false,"hidden":false,"merged":[[0,1,0,13],[4,2,4,3],[22,12,26,12],[1,5,3,5],[1,6,3,6],[12,1,12,3],[12,8,12,10],[13,1,13,4],[13,8,13,11],[16,5,16,6],[10,5,10,6],[16,12,16,13],[10,12,10,13],[6,5,7,7],[6,12,7,14],[12,12,13,14],[12,5,13,7],[9,21,9,22],[1,2,1,3],[2,2,2,3],[3,2,3,3],[7,1,7,4],[7,8,7,11],[1,4,3,4],[1,7,3,7],[1,8,3,8],[1,9,3,9],[1,10,3,10],[6,1,6,3],[6,8,6,10]]}
[null,"NJDEP Perimeter Air Monitoring HBTV\nand Response Level Calculator",null,null,null,null,null,null,null,null,null,null,null,null,null,1]
[null,"Site Name:",null,null,"Averaging Time (year)","Exposure Time (hours/24 hours)","Exposure Frequency (days/365 days)","Exposure Duration (year)","Number of Contaminants (Up to 4)",null,null,null,null,null,null,2]
[null,"Site PI #:",null,null,null,null,null,null,null,null,null,null,null,null,null,3]
[null,"Evaluated by:",null,null,null,null,null,null,null,null,null,null,null,null,null,4]
[null,"Date:",null,null,"1 (NC), 70 (C) ",8,30,1,4]
[]
[null,"Mercury (total)",null,null,{"$f":"VLOOKUP(B7,'Master Sheet'!$A$2:$AB$138,MATCH(\"CAS No.\",'Master Sheet'!$A$1:$AB$1,0),FALSE)","v":"7439-97-6"},{"$f":"IF(E7=\"1336-36-3\", \" \", IF('Calc Sheet'!A2=\"b\", \"For further guidance regarding analyzing CoCs as volatiles or particulates, refer to the User's Guide, Section 5.2.\", \" \"))","v":"For further guidance regarding analyzing CoCs as volatiles or particulates, refer to the User's Guide, Section 5.2."},null,null,"Benzene",null,null,{"$f":"VLOOKUP(I7,'Master Sheet'!$A$2:$AB$138,MATCH(\"CAS No.\",'Master Sheet'!$A$1:$AB$1,0),FALSE)","v":"71-43-2"},{"$f":"IF(L7=\"1336-36-3\", \" \", IF('Calc Sheet'!B2=\"b\",\"For further guidance regarding analyzing CoCs as volatiles or particulates, refer to the User's Guide, Section 5.2.\",\" \"))","v":" "}]
[null,{"$f":"IF('Calc Sheet'!A2=\"p\", \"Analyzed as Particulate\",IF('Calc Sheet'!A2=\"v\", \"Analyzed as Volatile\",\"Provide Justification for Analyzing as Volatile or Particulate\"))","v":"Provide Justification for Analyzing as Volatile or Particulate"},null,null,null,null,null,null,{"$f":"IF('Calc Sheet'!B2=\"p\",\"Analyzed as Particulate\",IF('Calc Sheet'!B2=\"v\", \"Analyzed as Volatile\", \"Provide Justification for Analyzing as Volatile or Particulate\"))","v":"Analyzed as Volatile"}]
[null,{"$f":"VLOOKUP(E7,'Master Sheet'!$B$2:$AB$138,MATCH(\"Basis for Final Toxicity Values\",'Master Sheet'!$B$1:$AB$1,0),FALSE)","v":"Inhalation Reference Concentration (µg/m3)"},{"$f":"VLOOKUP(E7,'Master Sheet'!$B$2:$AB$138,MATCH(\"Final Toxicity Values\",'Master Sheet'!$B$1:$AB$1,0),FALSE)","v":0.3},"HBTV (µg/m3)",{"$f":"IF(E7=\"7439-92-1\",'Calc Sheet'!A13,IF(C9=\"Not Available\", \"Appropriate Toxicity Value Not Available, Choose a Surrogate or Consult with Department\", 'Calc Sheet'!A5))","v":10.950000000000001},{"$f":"IF('Calc Sheet'!A2<>\"p\",\"HBTV (ppbv)\",\"\")","v":"HBTV (ppbv)"},{"$f":"IF(C9=\"Not Available\",\"Appropriate Toxicity Value Not Available\",IF('Calc Sheet'!A2<>\"p\",'Calc Sheet'!A12,\"\"))","v":1.3347001346029215},null,{"$f":"VLOOKUP(L7,'Master Sheet'!$B$2:$AB$138,MATCH(\"Basis for Final Toxicity Values\",'Master Sheet'!$B$1:$AB$1,0),FALSE)","v":"Inhalation Reference Concentration (µg/m3)"},{"$f":"VLOOKUP(L7,'Master Sheet'!$B$2:$AB$138,MATCH(\"Final Toxicity Values\",'Master Sheet'!$B$1:$AB$1,0),FALSE)","v":30},"HBTV (µg/m3)",{"$f":"IF(L7=\"7439-92-1\",'Calc Sheet'!B13,IF(J9=\"Not Available\", \"Appropriate Toxicity Value Not Available, Choose a Surrogate or Consult with Department\", 'Calc Sheet'!B5))","v":1095},{"$f":"IF('Calc Sheet'!B2<>\"p\",\"HBTV (ppbv)\",\"\")","v":"HBTV (ppbv)"},{"$f":"IF(J9=\"Not Available\",\"Appropriate Toxicity Value Not Available\",IF('Calc Sheet'!B2<>\"p\",'Calc Sheet'!B12,\"\"))","v":342.75700934579442}]
[null,{"$f":"IF('Calc Sheet'!A2=\"p\", \"Soil Concentration (mg/kg)\", \"Percent of Total Volatiles in Air\")","v":"Percent of Total Volatiles in Air"},null,"Response Level (µg/m3)",{"$f":"IF(C9=\"Not Available\",\"Not Available\",IF(C10=\"\",E9,IF(C10=0,\"\",IF(E7=\"7439-92-1\",'Calc Sheet'!A15,IF('Calc Sheet'!A2<>\"P\",'Calc Sheet'!A9,IF('Calc Sheet'!A9>150,150,'Calc Sheet'!A9))))))","v":10.950000000000001},{"$f":"IF('Calc Sheet'!A2<>\"p\",\"Response Level (ppbv)\",'Calc Sheet'!A17)","v":"Response Level (ppbv)"},{"$f":"IF('Calc Sheet'!A2=\"p\",\"\",IF(C9=\"Not Available\",\"Not Available\",IF(C10=\"\",G9,IF(C10=0,\"\",IF('Calc Sheet'!A2<>\"p\",'Calc Sheet'!A10,\"\")))))","v":1.3347001346029215},null,{"$f":"IF('Calc Sheet'!B2=\"p\", \"Soil Concentration (mg/kg)\", \"Percent of Total Volatiles in Air\")","v":"Percent of Total Volatiles in Air"},null,"Response Level (µg/m3)",{"$f":"IF(J9=\"Not Available\",\"Not Available\",IF(J10=\"\",L9,IF(J10=0,\"\",IF(L7=\"7439-92-1\",'Calc Sheet'!B15,IF('Calc Sheet'!B2<>\"P\",'Calc Sheet'!B9,IF('Calc Sheet'!B9>150,150,'Calc Sheet'!B9))))))","v":1095},{"$f":"IF('Calc Sheet'!B2<>\"p\",\"Response Level (ppbv)\",'Calc Sheet'!B17)","v":"Response Level (ppbv)"},{"$f":"IF('Calc Sheet'!B2=\"p\",\"\",IF(J9=\"Not Available\",\"Not Available\",IF(J10=\"\",N9,IF(J10=0,\"\",IF('Calc Sheet'!B2<>\"p\",'Calc Sheet'!B10,\"\")))))","v":342.75700934579442}]
[null,{"$f":"IF('Calc Sheet'!A2=\"b\", \"Soil Concentration (mg/kg)\", \"\")","v":"Soil Concentration (mg/kg)"},null,{"$f":"IF('Calc Sheet'!A2=\"b\", \"Response Level (µg/m3)\", \"\")","v":"Response Level (µg/m3)"},{"$f":"IF(C9=\"Not Available\",\"Not Available\",IF(C11=\"\",E9,IF(C11=0,\"\",IF('Calc Sheet'!A20>150,150,'Calc Sheet'!A20))))","v":10.950000000000001},{"$f":"IF(C9=\"Not Available\", \" \",IF('Calc Sheet'!A2=\"p\",'Calc Sheet'!A18,IF(C11=0,\"\",IF(C11=\"\",\"\",IF('Calc Sheet'!A2=\"b\",'Calc Sheet'!A21,'Calc Sheet'!A18)))))","v":""},null,null,{"$f":"IF('Calc Sheet'!B2=\"b\", \"Soil Concentration (mg/kg)\", \"\")","v":""},null,{"$f":"IF('Calc Sheet'!B2=\"b\", \"Response Level (µg/m3)\", \"\")","v":""},{"$f":"IF(J9=\"Not Available\",\"Not Available\",IF(J11=\"\",L9,IF(J11=0,\"\",IF('Calc Sheet'!B20>150,150,'Calc Sheet'!B20))))","v":1095},{"$f":"IF(J9=\"Not Available\", \" \",IF('Calc Sheet'!B2=\"p\",'Calc Sheet'!B18,IF(J11=0,\"\",IF(J11=\"\",\"\",IF('Calc Sheet'!B2=\"b\",'Calc Sheet'!B21,'Calc Sheet'!B18)))))","v":""}]
[]
[null,"Polychlorinated biphenyls (PCBs)",null,null,{"$f":"VLOOKUP(B13,'Master Sheet'!$A$2:$AB$138,MATCH(\"CAS No.\",'Master Sheet'!$A$1:$AB$1,0),FALSE)","v":"1336-36-3"},{"$f":"IF(E13=\"1336-36-3\", \" \", IF('Calc Sheet'!C2=\"b\", \"For further guidance regarding analyzing CoCs as volatiles or particulates, refer to the User's Guide, Section 5.2.\", \" \"))","v":" "},null,null,"Naphthalene",null,null,{"$f":"VLOOKUP(I13,'Master Sheet'!$A$2:$AB$138,MATCH(\"CAS No.\",'Master Sheet'!$A$1:$AB$1,0),FALSE)","v":"91-20-3"},{"$f":"IF(L13=\"1336-36-3\", \" \", IF('Calc Sheet'!D2=\"b\", \"For further guidance regarding analyzing CoCs as volatiles or particulates, refer to the User's Guide, Section 5.2.\", \" \"))","v":"For further guidance regarding analyzing CoCs as volatiles or particulates, refer to the User's Guide, Section 5.2."}]
[null,{"$f":"IF('Calc Sheet'!C2=\"p\",\"Analyzed as Particulate\",IF('Calc Sheet'!C2=\"v\",\"Analyzed as Volatile\",\"Provide Justification for Analyzing as Volatile or Particulate\"))","v":"Provide Justification for Analyzing as Volatile or Particulate"},null,null,null,null,null,null,{"$f":"IF('Calc Sheet'!D2=\"p\",\"Analyzed as Particulate\",IF('Calc Sheet'!D2=\"v\",\"Analyzed as Volatile\",\"Provide Justification for Analyzing as Volatile or Particulate\"))","v":"Provide Justification for Analyzing as Volatile or Particulate"}]
[null,{"$f":"VLOOKUP(E13,'Master Sheet'!$B$2:$AB$138,MATCH(\"Basis for Final Toxicity Values\",'Master Sheet'!$B$1:$AB$1,0),FALSE)","v":"Inhalation Unit Risk Factor (µg/m3)-1"},{"$f":"VLOOKUP(E13,'Master Sheet'!$B$2:$AB$138,MATCH(\"Final Toxicity Values\",'Master Sheet'!$B$1:$AB$1,0),FALSE)","v":5.6999999999999998E-4},"HBTV (µg/m3)",{"$f":"IF(E13=\"7439-92-1\",'Calc Sheet'!C13,IF(C15=\"Not Available\", \"Appropriate Toxicity Value Not Available, Choose a Surrogate or Consult with Department\", 'Calc Sheet'!C5))","v":4.4824561403508776},{"$f":"IF('Calc Sheet'!C2<>\"p\",\"HBTV (ppbv)\",\"\")","v":"HBTV (ppbv)"},{"$f":"IF(C15=\"Not Available\",\"Appropriate Toxicity Value Not Available\",IF('Calc Sheet'!C2<>\"p\",'Calc Sheet'!C12,\"\"))","v":"Refer to User's Guide Section 5.2"},null,{"$f":"VLOOKUP(L13,'Master Sheet'!$B$2:$AB$138,MATCH(\"Basis for Final Toxicity Values\",'Master Sheet'!$B$1:$AB$1,0),FALSE)","v":"Inhalation Reference Concentration (µg/m3)"},{"$f":"VLOOKUP(L13,'Master Sheet'!$B$2:$AB$138,MATCH(\"Final Toxicity Values\",'Master Sheet'!$B$1:$AB$1,0),FALSE)","v":3},"HBTV (µg/m3)",{"$f":"IF(L13=\"7439-92-1\",'Calc Sheet'!D13,IF(J15=\"Not Available\", \"Appropriate Toxicity Value Not Available, Choose a Surrogate or Consult with Department\", 'Calc Sheet'!D5))","v":109.5},{"$f":"IF('Calc Sheet'!D2<>\"p\",\"HBTV (ppbv)\",\"\")","v":"HBTV (ppbv)"},{"$f":"IF(J15=\"Not Available\",\"Appropriate Toxicity Value Not Available\",IF('Calc Sheet'!D2<>\"p\",'Calc Sheet'!D12,\"\"))","v":20.886838820408801}]
[null,{"$f":"IF('Calc Sheet'!C2=\"p\", \"Soil Concentration (mg/kg)\", \"Percent of Total Volatiles in Air\")","v":"Percent of Total Volatiles in Air"},null,"Response Level (µg/m3)",{"$f":"IF(C15=\"Not Available\",\"Not Available\",IF(C16=\"\",E15,IF(C16=0,\"\",IF(E13=\"7439-92-1\",'Calc Sheet'!C15,IF('Calc Sheet'!C2<>\"P\",'Calc Sheet'!C9,IF('Calc Sheet'!C9>150,150,'Calc Sheet'!C9))))))","v":4.4824561403508776},{"$f":"IF('Calc Sheet'!C2<>\"p\",\"Response Level (ppbv)\",'Calc Sheet'!C17)","v":"Response Level (ppbv)"},{"$f":"IF('Calc Sheet'!C2=\"p\",\"\",IF(C15=\"Not Available\",\"Not Available\",IF(C16=\"\",G15,IF(C16=0,\"\",IF('Calc Sheet'!C2<>\"p\",'Calc Sheet'!C10,\"\")))))","v":"Refer to User's Guide Section 5.2"},null,{"$f":"IF('Calc Sheet'!D2=\"p\", \"Soil Concentration (mg/kg)\", \"Percent of Total Volatiles in Air\")","v":"Percent of Total Volatiles in Air"},null,"Response Level (µg/m3)",{"$f":"IF(J15=\"Not Available\",\"Not Available\",IF(J16=\"\",L15,IF(J16=0,\"\",IF(L13=\"7439-92-1\",'Calc Sheet'!D15,IF('Calc Sheet'!D2<>\"P\",'Calc Sheet'!D9,IF('Calc Sheet'!D9>150,150,'Calc Sheet'!D9))))))","v":109.5},{"$f":"IF('Calc Sheet'!D2<>\"p\",\"Response Level (ppbv)\",'Calc Sheet'!D17)","v":"Response Level (ppbv)"},{"$f":"IF('Calc Sheet'!D2=\"p\",\"\",IF(J15=\"Not Available\",\"Not Available\",IF(J16=\"\",N15,IF(J16=0,\"\",IF('Calc Sheet'!D2<>\"p\",'Calc Sheet'!D10,\"\")))))","v":20.886838820408801}]
[null,{"$f":"IF('Calc Sheet'!C2=\"b\", \"Soil Concentration (mg/kg)\", \"\")","v":"Soil Concentration (mg/kg)"},null,{"$f":"IF('Calc Sheet'!C2=\"b\", \"Response Level (µg/m3)\", \"\")","v":"Response Level (µg/m3)"},{"$f":"IF(C15=\"Not Available\",\"Not Available\",IF(C17=\"\",E15,IF(C17=0,\"\",IF('Calc Sheet'!C20>150,150,'Calc Sheet'!C20))))","v":4.4824561403508776},{"$f":"IF(C15=\"Not Available\", \" \",IF('Calc Sheet'!C2=\"p\",'Calc Sheet'!C18,IF(C17=0,\"\",IF(C17=\"\",\"\",IF('Calc Sheet'!C2=\"b\",'Calc Sheet'!C21,'Calc Sheet'!C18)))))","v":""},null,null,{"$f":"IF('Calc Sheet'!D2=\"b\", \"Soil Concentration (mg/kg)\", \"\")","v":"Soil Concentration (mg/kg)"},null,{"$f":"IF('Calc Sheet'!D2=\"b\", \"Response Level (µg/m3)\", \"\")","v":"Response Level (µg/m3)"},{"$f":"IF(J15=\"Not Available\",\"Not Available\",IF(J17=\"\",L15,IF(J17=0,\"\",IF('Calc Sheet'!D20>150,150,'Calc Sheet'!D20))))","v":109.5},{"$f":"IF(J15=\"Not Available\", \" \",IF('Calc Sheet'!D2=\"p\",'Calc Sheet'!D18,IF(J17=0,\"\",IF(J17=\"\",\"\",IF('Calc Sheet'!D2=\"b\",'Calc Sheet'!D21,'Calc Sheet'!D18)))))","v":""}]

{"sheet":"Calc Sheet","index":2,"n_rows":171,"n_cols":9,"rows_kept":171,"cut":false,"hidden":true,"merged":[]}
[]
[{"$f":"VLOOKUP(Calculator!E7,'Calc Sheet'!$B$36:$C$171,MATCH(\"Type\",'Calc Sheet'!$B$35:$C$35,0),FALSE)","v":"B"},{"$f":"VLOOKUP(Calculator!L7,'Calc Sheet'!$B$36:$C$171,MATCH(\"Type\",'Calc Sheet'!$B$35:$C$35,0),FALSE)","v":"V"},{"$f":"VLOOKUP(Calculator!E13,'Calc Sheet'!$B$36:$C$171,MATCH(\"Type\",'Calc Sheet'!$B$35:$C$35,0),FALSE)","v":"B"},{"$f":"VLOOKUP(Calculator!L13,'Calc Sheet'!$B$36:$C$171,MATCH(\"Type\",'Calc Sheet'!$B$35:$C$35,0),FALSE)","v":"B"}]
[{"$f":"(Calculator!C9)/((Calculator!F5/24)*(Calculator!G5/365)*Calculator!H5)","v":10.950000000000001},{"$f":"(Calculator!J9)/((Calculator!F5/24)*(Calculator!G5/365)*Calculator!H5)","v":1095},{"$f":"(Calculator!C15)/((Calculator!F5/24)*(Calculator!G5/365)*Calculator!H5)","v":2.0805000000000001E-2},{"$f":"(Calculator!J15)/((Calculator!F5/24)*(Calculator!G5/365)*Calculator!H5)","v":109.5}]
[{"$f":"(0.000001)*(70)/(Calculator!C9*(Calculator!F5/24)*(Calculator!G5/365)*Calculator!H5)","v":8.5166666666666672E-3},{"$f":"(0.000001)*(70)/(Calculator!J9*(Calculator!F5/24)*(Calculator!G5/365)*Calculator!H5)","v":8.5166666666666659E-5},{"$f":"(0.000001)*(70)/(Calculator!C15*(Calculator!F5/24)*(Calculator!G5/365)*Calculator!H5)","v":4.4824561403508776},{"$f":"(0.000001)*(70)/(Calculator!J15*(Calculator!F5/24)*(Calculator!G5/365)*Calculator!H5)","v":8.5166666666666659E-4}]
[{"$f":"IF(Calculator!B9=\"Inhalation Unit Risk Factor (µg/m3)-1\", A4, A3)","v":10.950000000000001},{"$f":"IF(Calculator!I9=\"Inhalation Unit Risk Factor (µg/m3)-1\", B4, B3)","v":1095},{"$f":"IF(Calculator!B15=\"Inhalation Unit Risk Factor (µg/m3)-1\", C4, C3)","v":4.4824561403508776},{"$f":"IF(Calculator!I15=\"Inhalation Unit Risk Factor (µg/m3)-1\", D4, D3)","v":109.5}]
[{"$f":"A5*(1000000/Calculator!C10)","v":{"$error":"#DIV/0!"}},{"$f":"B5*(1000000/Calculator!J10)","v":{"$error":"#DIV/0!"}},{"$f":"C5*(1000000/Calculator!C16)","v":{"$error":"#DIV/0!"}},{"$f":"D5*(1000000/Calculator!J16)","v":{"$error":"#DIV/0!"}}]
[]
[{"$f":"A5*(100/Calculator!C10)","v":{"$error":"#DIV/0!"}},{"$f":"B5*(100/Calculator!J10)","v":{"$error":"#DIV/0!"}},{"$f":"C5*(100/Calculator!C16)","v":{"$error":"#DIV/0!"}},{"$f":"D5*(100/Calculator!J16)","v":{"$error":"#DIV/0!"}}]
[{"$f":"IF(Calculator!B10=\"Soil Concentration (mg/kg)\", A6, A8)","v":{"$error":"#DIV/0!"}},{"$f":"IF(Calculator!I10=\"Soil Concentration (mg/kg)\", B6, B8)","v":{"$error":"#DIV/0!"}},{"$f":"IF(Calculator!B16=\"Soil Concentration (mg/kg)\", C6, C8)","v":{"$error":"#DIV/0!"}},{"$f":"IF(Calculator!I16=\"Soil Concentration (mg/kg)\", D6, D8)","v":{"$error":"#DIV/0!"}}]
[{"$f":"IF(A11>0,A9*24.45/A11, \"Refer to User's Guide Section 5.2\")","v":{"$error":"#DIV/0!"}},{"$f":"IF(B11>0,B9*24.45/B11, \"Refer to User's Guide Section 5.2\")","v":{"$error":"#DIV/0!"}},{"$f":"IF(C11>0,C9*24.45/C11, \"Refer to User's Guide Section 5.2\")","v":"Refer to User's Guide Section 5.2"},{"$f":"IF(D11>0,D9*24.45/D11, \"Refer to User's Guide Section 5.2\")","v":{"$error":"#DIV/0!"}}]
[{"$f":"VLOOKUP(Calculator!E7,'Calc Sheet'!$B$36:$D$171,MATCH(\"Molecular Weight\",'Calc Sheet'!$B$35:$D$35,0),FALSE)","v":200.59},{"$f":"VLOOKUP(Calculator!L7,'Calc Sheet'!$B$36:$D$171,MATCH(\"Molecular Weight\",'Calc Sheet'!$B$35:$D$35,0),FALSE)","v":78.11},{"$f":"VLOOKUP(Calculator!E13,'Calc Sheet'!$B$36:$D$171,MATCH(\"Molecular Weight\",'Calc Sheet'!$B$35:$D$35,0),FALSE)","v":0},{"$f":"VLOOKUP(Calculator!L13,'Calc Sheet'!$B$36:$D$171,MATCH(\"Molecular Weight\",'Calc Sheet'!$B$35:$D$35,0),FALSE)","v":128.18}]
[{"$f":"IF(A11>0,A5*24.45/A11,\"Refer to User's Guide Section 5.2\")","v":1.3347001346029215},{"$f":"IF(B11>0,B5*24.45/B11,\"Refer to User's Guide Section 5.2\")","v":342.75700934579442},{"$f":"IF(C11>0, C5*24.45/C11, \"Refer to User's Guide Section 5.2\")","v":"Refer to User's Guide Section 5.2"},{"$f":"IF(D11>0,D5*24.45/D11,\"Refer to User's Guide Section 5.2\")","v":20.886838820408801}]
[{"$f":"(Calculator!C9)/(Calculator!F5/24)","v":0.9},{"$f":"(Calculator!J9)/(Calculator!F5/24)","v":90},{"$f":"(Calculator!C15)/(Calculator!F5/24)","v":1.7099999999999999E-3},{"$f":"(Calculator!J15)/(Calculator!F5/24)","v":9}]
[{"$f":"A13*(1000000/Calculator!C10)","v":{"$error":"#DIV/0!"}},{"$f":"B13*(1000000/Calculator!J10)","v":{"$error":"#DIV/0!"}},{"$f":"C13*(1000000/Calculator!C16)","v":{"$error":"#DIV/0!"}},{"$f":"D13*(1000000/Calculator!J16)","v":{"$error":"#DIV/0!"}}]
[{"$f":"IF(A14>150, 150,A14)","v":{"$error":"#DIV/0!"}},{"$f":"IF(B14>150, 150,B14)","v":{"$error":"#DIV/0!"}},{"$f":"IF(C14>150, 150,C14)","v":{"$error":"#DIV/0!"}},{"$f":"IF(D14>150, 150,D14)","v":{"$error":"#DIV/0!"}}]
[{"$f":"IF(A22>=150,\"Value Exceeds NAAQS of 150 ug/m3; therefore, the NAAQS limit is the default Response Level\",\"\")","v":{"$error":"#DIV/0!"}},{"$f":"IF(B22>=150,\"Value Exceeds NAAQS of 150 ug/m3; therefore, the NAAQS limit is the default Response Level\",\"\")","v":{"$error":"#DIV/0!"}},{"$f":"IF(C22>=150,\"Value Exceeds NAAQS of 150 ug/m3; therefore, the NAAQS limit is the default Response Level\",\"\")","v":{"$error":"#DIV/0!"}},{"$f":"IF(D22>=150,\"Value Exceeds NAAQS of 150 ug/m3; therefore, the NAAQS limit is the default Response Level\",\"\")","v":{"$error":"#DIV/0!"}}]
[{"$f":"IF('Calc Sheet'!A2<>\"P\",\"\",IF(Calculator!C10=\"\",\"\",IF(Calculator!C10=0,\"\",IF(Calculator!C9=\"NA\",\"\",IF(Calculator!E7=\"7439-92-1\",A16,IF(A23>=150,\"Value Exceeds NAAQS of 150 ug/m3; \",\"\"))))))","v":""},{"$f":"IF('Calc Sheet'!B2<>\"P\",\"\",IF(Calculator!J10=\"\",\"\",IF(Calculator!J10=0,\"\",IF(Calculator!J9=\"NA\",\"\",IF(Calculator!L7=\"7439-92-1\",B16,IF(B23>=150,\"Value Exceeds NAAQS of 150 ug/m3; \",\"\"))))))","v":""},{"$f":"IF('Calc Sheet'!C2<>\"P\",\"\",IF(Calculator!C16=\"\",\"\",IF(Calculator!C16=0,\"\",IF(Calculator!C15=\"NA\",\"\",IF(Calculator!E13=\"7439-92-1\",C16,IF(C23>=150,\"Value Exceeds NAAQS of 150 ug/m3; \",\"\"))))))","v":""},{"$f":"IF('Calc Sheet'!D2<>\"P\",\"\",IF(Calculator!J16=\"\",\"\",IF(Calculator!J16=0,\"\",IF(Calculator!J15=\"NA\",\"\",IF(Calculator!L13=\"7439-92-1\",D16,IF(D23>=150,\"Value Exceeds NAAQS of 150 ug/m3; \",\"\"))))))","v":""}]
[{"$f":"IF('Calc Sheet'!A2<>\"P\",\"\",IF(Calculator!C10=\"\",\"\",IF(Calculator!C10=0,\"\",IF(Calculator!C9=\"NA\",\"\",IF(Calculator!E7=\"7439-92-1\",A19,IF(A23>=150,\"therefore, value                                           defaults to                                           NAAQS limit\",\"\"))))))","v":""},{"$f":"IF('Calc Sheet'!B2<>\"P\",\"\",IF(Calculator!J10=\"\",\"\",IF(Calculator!J10=0,\"\",IF(Calculator!J9=\"NA\",\"\",IF(Calculator!L7=\"7439-92-1\",B19,IF(B23>=150,\"therefore, value                                           defaults to                                           NAAQS limit\",\"\"))))))","v":""},{"$f":"IF('Calc Sheet'!C2<>\"P\",\"\",IF(Calculator!C16=\"\",\"\",IF(Calculator!C16=0,\"\",IF(Calculator!C15=\"NA\",\"\",IF(Calculator!E13=\"7439-92-1\",C19,IF(C23>=150,\"therefore, value                                           defaults to                                           NAAQS limit\",\"\"))))))","v":""},{"$f":"IF('Calc Sheet'!D2<>\"P\",\"\",IF(Calculator!J16=\"\",\"\",IF(Calculator!J16=0,\"\",IF(Calculator!J15=\"NA\",\"\",IF(Calculator!L13=\"7439-92-1\",D19,IF(D23>=150,\"therefore, value                                           defaults to                                           NAAQS limit\",\"\"))))))","v":""}]
[{"$f":"IF(A22>=150,\"therefore,                                            value defaults to                                                NAAQS limit\",\"\")","v":{"$error":"#DIV/0!"}},{"$f":"IF(B22>=150,\"therefore,                                            value defaults to                                                NAAQS limit\",\"\")","v":{"$error":"#DIV/0!"}},{"$f":"IF(C22>=150,\"therefore,                                            value defaults to                                                NAAQS limit\",\"\")","v":{"$error":"#DIV/0!"}},{"$f":"IF(D22>=150,\"therefore,                                            value defaults to                                                NAAQS limit\",\"\")","v":{"$error":"#DIV/0!"}}]
[{"$f":"A5*(1000000/Calculator!C11)","v":{"$error":"#DIV/0!"}},{"$f":"B5*(1000000/Calculator!J11)","v":{"$error":"#DIV/0!"}},{"$f":"C5*(1000000/Calculator!C17)","v":{"$error":"#DIV/0!"}},{"$f":"D5*(1000000/Calculator!J17)","v":{"$error":"#DIV/0!"}}]
{"$rows_left_out":152}
{"sheet":"User's Guide","index":3,"n_rows":254,"n_cols":1,"rows_kept":254,"cut":false,"hidden":false,"merged":[[0,0,22,0],[131,0,221,0],[101,0,130,0],[222,0,252,0],[253,0,280,0],[23,0,60,0],[61,0,78,0],[79,0,100,0]]}
["User's Guide\n\n1. Enter the Site name, PI #, the name of person conducting the evaluation, and the date.\n2. Enter the number of hours per day and days per year.\n3. Select the number of chemicals that need an HBTV and Initial Response Level.\n4. Select the chemicals from the drop-down list(s).\n5. Enter the soil concentration or percent of total volatiles for each chemical, as appropriate.\n6. Print results.\n\n  Table of Contents:"]
[]
[]
[]
[]
[]
[]
[]
[]
[]
[]
[]
[]
[]
[]
[]
[]
[]
[]
[]
{"$rows_left_out":234}